Target
Mitogen-activated protein kinase 1
Ligand
BDBM50305126
Substrate
Meas. Tech.
ChEMBL_603263 (CHEMBL1049487)
IC50
>10000±n/a nM
Citation
 Takayama, TUmemiya, HAmada, HYabuuchi, TKoami, TShiozawa, FOka, YTakaoka, AYamaguchi, AEndo, MSato, M Ring-fused pyrazole derivatives as potent inhibitors of lymphocyte-specific kinase (Lck): Structure, synthesis, and SAR. Bioorg Med Chem Lett 20:112-6 (2010)  
Target
Name:
Mitogen-activated protein kinase 1
Synonyms:
ERK2 Extracellular signal-regulated kinase 2 Extracellular signal-regulated kinase 2 (ERK2) MAPK 2 MK01_HUMAN Mitogen-activated protein kinase 1 (ERK-2) Mitogen-activated protein kinase 2 PRKM2 | p42-MAPK
Type:
Ser/Thr Protein Kinase
Mol. Mass.:
41392.76
Organism:
Homo sapiens (Human)
Description:
P28482
Residue:
360
  
Inhibitor
Name:
BDBM50305126
Synonyms:
7-(2-(dimethylamino)ethoxy)-2-(4-phenoxyphenyl)-9,10-dihydro-4H-benzo[d]pyrazolo[1,5-a][1,3]diazepine-3-carboxamide | CHEMBL591325
Type:
Small organic molecule
Emp. Form.:
C28H29N5O3
Mol. Mass.:
483.5616
SMILES:
CN(C)CCOc1ccc2Nc3c(C(N)=O)c(nn3CCc2c1)-c1ccc(Oc2ccccc2)cc1
: