Target
Tyrosine-protein kinase Lck
Ligand
BDBM50305130
Substrate
Meas. Tech.
ChEMBL_603253 (CHEMBL1049477)
IC50
1.2±n/a nM
Citation
 Takayama, TUmemiya, HAmada, HYabuuchi, TKoami, TShiozawa, FOka, YTakaoka, AYamaguchi, AEndo, MSato, M Ring-fused pyrazole derivatives as potent inhibitors of lymphocyte-specific kinase (Lck): Structure, synthesis, and SAR. Bioorg Med Chem Lett 20:112-6 (2010)  
Target
Name:
Tyrosine-protein kinase Lck
Synonyms:
2.7.10.2 LCK_HUMAN Leukocyte C-terminal Src kinase Lymphocyte-specific protein tyrosine kinase Protein YT16 Proto-oncogene tyrosine-protein kinase LCK T cell-specific protein-tyrosine kinase
Type:
Mol. Mass.:
57987.83
Organism:
Homo sapiens (Human)
Description:
P06239
Residue:
509
  
Inhibitor
Name:
BDBM50305130
Synonyms:
6-(2-(dimethylamino)ethoxy)-2-(4-phenoxyphenyl)-9,10-dihydro-4H-benzo[d]pyrazolo[1,5-a][1,3]diazepine-3-carboxamide | CHEMBL591322
Type:
Small organic molecule
Emp. Form.:
C28H29N5O3
Mol. Mass.:
483.5616
SMILES:
CN(C)CCOc1ccc2CCn3nc(c(C(N)=O)c3Nc2c1)-c1ccc(Oc2ccccc2)cc1
: