Target
Tyrosine-protein kinase Lck
Ligand
BDBM50305145
Substrate
Meas. Tech.
ChEMBL_603253 (CHEMBL1049477)
IC50
2.8±n/a nM
Citation
 Takayama, TUmemiya, HAmada, HYabuuchi, TKoami, TShiozawa, FOka, YTakaoka, AYamaguchi, AEndo, MSato, M Ring-fused pyrazole derivatives as potent inhibitors of lymphocyte-specific kinase (Lck): Structure, synthesis, and SAR. Bioorg Med Chem Lett 20:112-6 (2010)  
Target
Name:
Tyrosine-protein kinase Lck
Synonyms:
2.7.10.2 LCK_HUMAN Leukocyte C-terminal Src kinase Lymphocyte-specific protein tyrosine kinase Protein YT16 Proto-oncogene tyrosine-protein kinase LCK T cell-specific protein-tyrosine kinase
Type:
Mol. Mass.:
57987.83
Organism:
Homo sapiens (Human)
Description:
P06239
Residue:
509
  
Inhibitor
Name:
BDBM50305145
Synonyms:
2-(4-phenoxyphenyl)-7-(pyridin-3-ylmethoxy)-9,10-dihydro-4H-benzo[d]pyrazolo[1,5-a][1,3]diazepine-3-carboxamide | CHEMBL600873
Type:
Small organic molecule
Emp. Form.:
C30H25N5O3
Mol. Mass.:
503.5512
SMILES:
NC(=O)c1c2Nc3ccc(OCc4cccnc4)cc3CCn2nc1-c1ccc(Oc2ccccc2)cc1
: