Target
Beta-secretase 1
Ligand
BDBM50312538
Substrate
Meas. Tech.
ChEMBL_615090 (CHEMBL1106031)
IC50
6.6±n/a nM
Citation
 Wångsell, FGustafsson, KKvarnström, IBorkakoti, NEdlund, MJansson, KLindberg, JHallberg, ARosenquist, ASamuelsson, B Synthesis of potent BACE-1 inhibitors incorporating a hydroxyethylene isostere as central core. Eur J Med Chem 45:870-82 (2010)  
Target
Name:
Beta-secretase 1
Synonyms:
ASP2 Aspartyl protease 2 BACE1 Beta-secretase (BACE) Beta-secretase 1 (BACE 1) Beta-secretase 1 (BACE1) Beta-site amyloid precursor protein cleaving enzyme 1 Memapsin-2 beta-Secretase (BACE-1) | beta-Secretase (BACE1)
Type:
Protein
Mol. Mass.:
55755.10
Organism:
Homo sapiens (Human)
Description:
P56817
Residue:
501
  
Inhibitor
Name:
BDBM50312538
Synonyms:
CHEMBL1076902 N-[(2S,3S,5R)-1-[(3,5-difluorophenyl)methoxy]-3-hydroxy-5-methyl-6-[[(2S)-3-methyl-1-oxo-1-(phenylmethylamino)butan-2-yl]amino]-6-oxo-hexan-2-yl]-5-(methyl-methylsulfonyl-amino)-N'-[(1R)-1-phenylethyl]benzene-1,3-dicarboxamide
Type:
Small organic molecule
Emp. Form.:
C44H53F2N5O8S
Mol. Mass.:
849.982
SMILES:
CC(C)[C@H](NC(=O)[C@H](C)C[C@H](O)[C@H](COCc1cc(F)cc(F)c1)NC(=O)c1cc(cc(c1)C(=O)N[C@H](C)c1ccccc1)N(C)S(C)(=O)=O)C(=O)NCc1ccccc1
: