Target
Lysosomal alpha-glucosidase
Ligand
BDBM50398022
Substrate
Meas. Tech.
ChEMBL_873177 (CHEMBL2183408)
IC50
1300±n/a nM
Citation
 Xiao, JWestbroek, WMotabar, OLea, WAHu, XVelayati, AZheng, WSouthall, NGustafson, AMGoldin, ESidransky, ELiu, KSimeonov, ATamargo, RJRibes, AMatalonga, LFerrer, MMarugan, JJ Discovery of a novel noniminosugar acida glucosidase chaperone series. J Med Chem 55:7546-59 (2012)  
Target
Name:
Lysosomal alpha-glucosidase
Synonyms:
70 kDa lysosomal alpha-glucosidase Acid maltase Alpha glucosidase LYAG_HUMAN
Type:
PROTEIN
Mol. Mass.:
105312.45
Organism:
Homo sapiens (Human)
Description:
ChEMBL_1506060
Residue:
952
  
Inhibitor
Name:
BDBM50398022
Synonyms:
CHEMBL2181097
Type:
Small organic molecule
Emp. Form.:
C19H19N3O5S
Mol. Mass.:
401.436
SMILES:
OC(=O)c1ccc(cc1)N1CCN(CC1)S(=O)(=O)c1ccc2NC(=O)Cc2c1
: