Target
Beta-3 adrenergic receptor
Ligand
BDBM97162
Substrate
Meas. Tech.
ChEMBL_218265 (CHEMBL819430)
EC50
190.55±n/a nM
Citation
 Tanaka, NTamai, TMukaiyama, HHirabayashi, AMuranaka, HAkahane, SMiyata, HAkahane, M Discovery of novel N-phenylglycine derivatives as potent and selective beta(3)-adrenoceptor agonists for the treatment of frequent urination and urinary incontinence. J Med Chem 44:1436-45 (2001)  
Target
Name:
Beta-3 adrenergic receptor
Synonyms:
ADRB3_RAT Adrb3r Beta-3 adrenergic receptor
Type:
PROTEIN
Mol. Mass.:
43161.83
Organism:
Rattus norvegicus
Description:
ChEMBL_1509452
Residue:
400
  
Inhibitor
Name:
BDBM97162
Synonyms:
MLS002153782 RITODRINE HYDROCHLORIDE cid_31728
Type:
Small organic molecule
Emp. Form.:
C17H21NO3
Mol. Mass.:
287.3535
SMILES:
C[C@H](NCCc1ccc(O)cc1)[C@H](O)c1ccc(O)cc1
: