Target
Muscarinic acetylcholine receptor M2
Ligand
BDBM50413109
Substrate
Meas. Tech.
ChEMBL_496880 (CHEMBL998549)
Kd
0.0501±n/a nM
Citation
 Jin, JWang, YShi, DWang, FFu, WDavis, RSJin, QFoley, JJSarau, HMMorrow, DMMoore, MLRivero, RAPalovich, MSalmon, MBelmonte, KEBusch-Petersen, J Muscarinic acetylcholine receptor antagonists: SAR and optimization of tyrosine ureas. Bioorg Med Chem Lett 18:5481-6 (2008)  
Target
Name:
Muscarinic acetylcholine receptor M2
Synonyms:
ACM2_HUMAN Cholinergic, muscarinic M2 Muscarinic acetylcholine receptor M2 and M5 | RecName: Full=Muscarinic acetylcholine receptor M2
Type:
GPCR
Mol. Mass.:
51730.61
Organism:
Homo sapiens (Human)
Description:
P08172
Residue:
466
  
Inhibitor
Name:
BDBM50413109
Synonyms:
CHEMBL553448
Type:
Small organic molecule
Emp. Form.:
C34H43N4O6S
Mol. Mass.:
635.793
SMILES:
C[N+]1(Cc2ccc(O)cc2)CCC[C@@H](C1)NC(=O)[C@H](Cc1ccc(O)cc1)NC(=O)Nc1ccc(s1)C(=O)OC1CCCCC1
: