Target
L-lactate dehydrogenase A chain
Ligand
BDBM50433841
Substrate
Meas. Tech.
ChEMBL_959389 (CHEMBL2384180)
Kd
2900±n/a nM
Citation
 Dragovich, PSFauber, BPCorson, LBDing, CZEigenbrot, CGe, HGiannetti, AMHunsaker, TLabadie, SLiu, YMalek, SPan, BPeterson, DPitts, KPurkey, HESideris, SUltsch, MVanderPorten, EWei, BXu, QYen, IYue, QZhang, HZhang, X Identification of substituted 2-thio-6-oxo-1,6-dihydropyrimidines as inhibitors of human lactate dehydrogenase. Bioorg Med Chem Lett 23:3186-94 (2013)  
Target
Name:
L-lactate dehydrogenase A chain
Synonyms:
Cell proliferation-inducing gene 19 protein L-lactate dehydrogenase A Chain LDH-A LDHA Lactate dehydrogenase A (LDHA) | Renal carcinoma antigen NY-REN-59
Type:
Protein
Mol. Mass.:
36694.85
Organism:
Homo sapiens (Human)
Description:
P00338::PDB Code: 4ajp
Residue:
332
  
Inhibitor
Name:
BDBM50433841
Synonyms:
CHEMBL2382403
Type:
Small organic molecule
Emp. Form.:
C20H15ClFN5O4S2
Mol. Mass.:
507.946
SMILES:
CC(Sc1nc(-c2ccc(Cl)c(F)c2)c(C#N)c(=O)[nH]1)C(=O)Nc1ccc(cc1)S(N)(=O)=O
: