Target
Cytochrome P450 2C9
Ligand
BDBM50435738
Substrate
Meas. Tech.
ChEMBL_965762 (CHEMBL2393701)
IC50
>25000±n/a nM
Citation
 Thalji, RKMcAtee, JJBelyanskaya, SBrandt, MBrown, GDCostell, MHDing, YDodson, JWEisennagel, SHFries, REGross, JWHarpel, MRHolt, DAIsrael, DIJolivette, LJKrosky, DLi, HLu, QMandichak, TRoethke, TSchnackenberg, CGSchwartz, BShewchuk, LMXie, WBehm, DJDouglas, SAShaw, ALMarino, JP Discovery of 1-(1,3,5-triazin-2-yl)piperidine-4-carboxamides as inhibitors of soluble epoxide hydrolase. Bioorg Med Chem Lett 23:3584-8 (2013)  
Target
Name:
Cytochrome P450 2C9
Synonyms:
(R)-limonene 6-monooxygenase CP2C9_HUMAN CYP2C9 Cytochrome P450 2C9 (CYP2C9 ) P-450MP P450 PB-1 | S-mephenytoin 4-hydroxylase
Type:
Enzyme
Mol. Mass.:
55636.33
Organism:
Homo sapiens (Human)
Description:
P11712
Residue:
490
  
Inhibitor
Name:
BDBM50435738
Synonyms:
CHEMBL2392690
Type:
Small organic molecule
Emp. Form.:
C19H22F4N6O
Mol. Mass.:
426.4112
SMILES:
CNc1nc(C)nc(n1)N1CCC(CC1)C(=O)NCc1ccc(F)cc1C(F)(F)F
: