Target
Lysine-specific demethylase 6A
Ligand
BDBM50440291
Substrate
Meas. Tech.
ChEMBL_982480 (CHEMBL2427606)
IC50
>100000±n/a nM
Citation
 Suzuki, TOzasa, HItoh, YZhan, PSawada, HMino, KWalport, LOhkubo, RKawamura, AYonezawa, MTsukada, YTumber, ANakagawa, HHasegawa, MSasaki, RMizukami, TSchofield, CJMiyata, N Identification of the KDM2/7 histone lysine demethylase subfamily inhibitor and its antiproliferative activity. J Med Chem 56:7222-31 (2013)  
Target
Name:
Lysine-specific demethylase 6A
Synonyms:
Histone demethylase UTX KDM6A_HUMAN Lysine-specific demethylase 6A (KDM6A(UTX)) UTX Ubiquitously-transcribed X chromosome tetratricopeptide repeat protein
Type:
Protein
Mol. Mass.:
154198.48
Organism:
Homo sapiens (Human)
Description:
O15550
Residue:
1401
  
Inhibitor
Name:
BDBM50440291
Synonyms:
CHEMBL2424810
Type:
Small organic molecule
Emp. Form.:
C16H31NO4
Mol. Mass.:
301.4216
SMILES:
COC(=O)CCN(O)C(=O)CCCCCCCCC(C)C
: