Target
Lysine-specific demethylase 6A
Ligand
BDBM50395076
Substrate
Meas. Tech.
ChEMBL_982480 (CHEMBL2427606)
IC50
>100000±n/a nM
Citation
 Suzuki, TOzasa, HItoh, YZhan, PSawada, HMino, KWalport, LOhkubo, RKawamura, AYonezawa, MTsukada, YTumber, ANakagawa, HHasegawa, MSasaki, RMizukami, TSchofield, CJMiyata, N Identification of the KDM2/7 histone lysine demethylase subfamily inhibitor and its antiproliferative activity. J Med Chem 56:7222-31 (2013)  
Target
Name:
Lysine-specific demethylase 6A
Synonyms:
Histone demethylase UTX KDM6A_HUMAN Lysine-specific demethylase 6A (KDM6A(UTX)) UTX Ubiquitously-transcribed X chromosome tetratricopeptide repeat protein
Type:
Protein
Mol. Mass.:
154198.48
Organism:
Homo sapiens (Human)
Description:
O15550
Residue:
1401
  
Inhibitor
Name:
BDBM50395076
Synonyms:
CHEMBL2164243
Type:
Small organic molecule
Emp. Form.:
C6H12N2O3
Mol. Mass.:
160.1711
SMILES:
CN(C)NC(=O)CCC(O)=O
: