Target
L-lactate dehydrogenase A chain
Ligand
BDBM50441120
Substrate
Meas. Tech.
ChEMBL_984205 (CHEMBL2432258)
Kd
3000±n/a nM
Citation
 Fauber, BPDragovich, PSChen, JCorson, LBDing, CZEigenbrot, CGiannetti, AMHunsaker, TLabadie, SLiu, YLiu, YMalek, SPeterson, DPitts, KSideris, SUltsch, MVanderPorten, EWang, JWei, BYen, IYue, Q Identification of 2-amino-5-aryl-pyrazines as inhibitors of human lactate dehydrogenase. Bioorg Med Chem Lett 23:5533-9 (2013)  
Target
Name:
L-lactate dehydrogenase A chain
Synonyms:
Cell proliferation-inducing gene 19 protein L-lactate dehydrogenase A Chain LDH-A LDHA Lactate dehydrogenase A (LDHA) | Renal carcinoma antigen NY-REN-59
Type:
Protein
Mol. Mass.:
36694.85
Organism:
Homo sapiens (Human)
Description:
P00338::PDB Code: 4ajp
Residue:
332
  
Inhibitor
Name:
BDBM50441120
Synonyms:
CHEMBL2430732
Type:
Small organic molecule
Emp. Form.:
C20H20N4O2
Mol. Mass.:
348.3984
SMILES:
C[C@@H](Nc1nc(cnc1N)-c1cc(ccc1C)C(O)=O)c1ccccc1
: