Target
Retinal rod rhodopsin-sensitive cGMP 3',5'-cyclic phosphodiesterase subunit delta
Ligand
BDBM50019811
Substrate
Meas. Tech.
ChEMBL_1361547 (CHEMBL3294871)
Kd
474±n/a nM
Citation
 Zimmermann, GSchultz-Fademrecht, CKüchler, PMurarka, SIsmail, STriola, GNussbaumer, PWittinghofer, AWaldmann, H Structure guided design and kinetic analysis of highly potent benzimidazole inhibitors targeting the PDEd prenyl binding site. J Med Chem 57:5435-48 (2014)  
Target
Name:
Retinal rod rhodopsin-sensitive cGMP 3',5'-cyclic phosphodiesterase subunit delta
Synonyms:
3',5'-cyclic phosphodiesterase PDE6D PDED Retinal rod rhodopsin-sensitive cGMP 3',5'-cyclic phosphodiesterase subunit delta
Type:
PROTEIN
Mol. Mass.:
17418.30
Organism:
Homo sapiens (Human)
Description:
ChEMBL_105761
Residue:
150
  
Inhibitor
Name:
BDBM50019811
Synonyms:
CHEMBL3286896
Type:
Small organic molecule
Emp. Form.:
C41H39N5O
Mol. Mass.:
617.7813
SMILES:
Cc1ccccc1Cn1c(nc2ccccc12)-c1ccc(OCC(C2CCNCC2)n2c(nc3ccccc23)-c2ccccc2)cc1
: