Target
Retinal rod rhodopsin-sensitive cGMP 3',5'-cyclic phosphodiesterase subunit delta
Ligand
BDBM50019815
Substrate
Meas. Tech.
ChEMBL_1361547 (CHEMBL3294871)
Kd
17±n/a nM
Citation
 Zimmermann, GSchultz-Fademrecht, CKüchler, PMurarka, SIsmail, STriola, GNussbaumer, PWittinghofer, AWaldmann, H Structure guided design and kinetic analysis of highly potent benzimidazole inhibitors targeting the PDEd prenyl binding site. J Med Chem 57:5435-48 (2014)  
Target
Name:
Retinal rod rhodopsin-sensitive cGMP 3',5'-cyclic phosphodiesterase subunit delta
Synonyms:
3',5'-cyclic phosphodiesterase PDE6D PDED Retinal rod rhodopsin-sensitive cGMP 3',5'-cyclic phosphodiesterase subunit delta
Type:
PROTEIN
Mol. Mass.:
17418.30
Organism:
Homo sapiens (Human)
Description:
ChEMBL_105761
Residue:
150
  
Inhibitor
Name:
BDBM50019815
Synonyms:
CHEMBL3286899
Type:
Small organic molecule
Emp. Form.:
C38H39N5O2
Mol. Mass.:
597.7486
SMILES:
CC(C)C(COC(=O)C1CCN(CC1)c1nc2ccccc2n1Cc1ccccc1)n1c(nc2ccccc12)-c1ccccc1
: