Target
Retinal rod rhodopsin-sensitive cGMP 3',5'-cyclic phosphodiesterase subunit delta
Ligand
BDBM50019844
Substrate
Meas. Tech.
ChEMBL_1361547 (CHEMBL3294871)
Kd
8.0±n/a nM
Citation
 Zimmermann, GSchultz-Fademrecht, CKüchler, PMurarka, SIsmail, STriola, GNussbaumer, PWittinghofer, AWaldmann, H Structure guided design and kinetic analysis of highly potent benzimidazole inhibitors targeting the PDEd prenyl binding site. J Med Chem 57:5435-48 (2014)  
Target
Name:
Retinal rod rhodopsin-sensitive cGMP 3',5'-cyclic phosphodiesterase subunit delta
Synonyms:
3',5'-cyclic phosphodiesterase PDE6D PDED Retinal rod rhodopsin-sensitive cGMP 3',5'-cyclic phosphodiesterase subunit delta
Type:
PROTEIN
Mol. Mass.:
17418.30
Organism:
Homo sapiens (Human)
Description:
ChEMBL_105761
Residue:
150
  
Inhibitor
Name:
BDBM50019844
Synonyms:
CHEMBL3286910
Type:
Small organic molecule
Emp. Form.:
C35H42N6O2S
Mol. Mass.:
610.812
SMILES:
CC(C)c1nc2ccccc2n1[C@H](COC(=O)C1CCN(CC1)c1nc2ccccc2n1Cc1ccsc1)C1CCNCC1
: