Target
Hormone-sensitive lipase
Ligand
BDBM97630
Substrate
Meas. Tech.
HSL Enzyme Assay
pH
7.2±0
Temperature
277.15±0 K
IC50
9e+1±n/a nM
Citation
 Ackermann, JConte, AHunziker, DNeidhart, WNettekoven, MSchulz-Gasch, TWertheimer, S Azacyclic compounds US Patent  US8470843 Publication Date 6/25/2013 
Target
Name:
Hormone-sensitive lipase
Synonyms:
HSL Hormone-sensitive lipase (HSL) LIPS_HUMAN
Type:
Protein
Mol. Mass.:
116599.07
Organism:
Homo sapiens (Human)
Description:
Q05469
Residue:
1076
  
Inhibitor
Name:
BDBM97630
Synonyms:
US8470843, 6
Type:
Small organic molecule
Emp. Form.:
C19H25F3N2O5S
Mol. Mass.:
450.472
SMILES:
CC(C)CS(=O)(=O)N1CCC2(CCN(C2=O)c2ccc(OC(F)(F)F)cc2)C(O)C1
: