Target
Phenylalanine--tRNA ligase alpha/beta subunit
Ligand
BDBM231665
Substrate
Meas. Tech.
Aminoacylation Assay
pH
8±n/a
IC50
2.7±n/a nM
Comments
extracted
Citation
 Abibi, AFerguson, ADFleming, PRGao, NHajec, LIHu, JLaganas, VAMcKinney, DCMcLeod, SMPrince, DBShapiro, ABBuurman, ET The role of a novel auxiliary pocket in bacterial phenylalanyl-tRNA synthetase druggability. J Biol Chem 289:21651-62 (2014)  
Target
Name:
Phenylalanine--tRNA ligase alpha/beta subunit
Synonyms:
Phenylalanyl-tRNA synthetase (PheRS)
Type:
Enzyme
Mol. Mass.:
Description:
E. coli PheRS
Components:
This complex has 2 components.
Component 1
Name:
Phenylalanine--tRNA ligase alpha subunit
Synonyms:
Phenylalanyl-tRNA synthetase alpha subunit (PheRS) pheS
Type:
Enzyme
Mol. Mass.:
36828.85
Organism:
Escherichia coli (Enterobacteria)
Description:
P08312
Residue:
327
  
Component 2
Name:
Phenylalanine--tRNA ligase beta subunit
Synonyms:
Phenylalanyl-tRNA synthetase beta subunit (PheRSβ) pheT
Type:
Enzyme
Mol. Mass.:
87356.43
Organism:
Escherichia coli (Enterobacteria)
Description:
P07395
Residue:
795
  
Inhibitor
Name:
BDBM231665
Synonyms:
1-(3-(4-(Pyridin-2-yl)piperazin-1-ylsulfonyl)phenyl)-3-(thiazol-2-yl)urea (1a)
Type:
Small organic molecule
Emp. Form.:
C19H20N6O3S2
Mol. Mass.:
444.53
SMILES:
O=C(Nc1nccs1)Nc1cccc(c1)S(=O)(=O)N1CCN(CC1)c1ccccn1
: