Target
Ataxin-1
Ligand
BDBM475941
Substrate
Meas. Tech.
ATX Inhibition
IC50
1.40±n/a nM
Citation
 Auberson, YBriard, ELe Grand, DOberhauser, B Pet imaging agents US Patent  US10865195 Publication Date 12/15/2020 
Target
Name:
Ataxin-1
Synonyms:
ATX1 ATXN1 | SCA1
Type:
Protein
Mol. Mass.:
86941.25
Organism:
Homo sapiens (Human)
Description:
P54253
Residue:
815
  
Inhibitor
Name:
BDBM475941
Synonyms:
US10865195, Compound 6
Type:
Small organic molecule
Emp. Form.:
C23H25F4N7O2
Mol. Mass.:
507.4839
SMILES:
C[C@@H]1CN(Cc2coc(CF)n2)CCN1C(=O)\C=C\c1ccc(cc1Cn1nnc(C)n1)C(F)(F)F
: