Target
Orexin receptor type 2
Ligand
BDBM479228
Substrate
Meas. Tech.
Orexin Receptor Cell-Based Functional Assay
IC50
>5000±n/a nM
Citation
 Kamenecka, TMHolenz, JWesolowski, SHe, YBürli, R Halo-substituted piperidines as orexin receptor modulators US Patent  US10894789 Publication Date 1/19/2021 
Target
Name:
Orexin receptor type 2
Synonyms:
HCRTR2 OX2R_HUMAN Orexin receptor type 2 (OR-2) Orexin receptor type 2 (OX2R) Ox-2-R | Ox2-R
Type:
Protein
Mol. Mass.:
50710.53
Organism:
Homo sapiens (Human)
Description:
O43614
Residue:
444
  
Inhibitor
Name:
BDBM479228
Synonyms:
US10894789, Compound 130
Type:
Small organic molecule
Emp. Form.:
C22H22F5N7O
Mol. Mass.:
495.4484
SMILES:
C[C@@H]1CC(F)(F)CN(C1CNc1cnc(cn1)C(F)(F)F)C(=O)c1nn(C)cc1-c1ccccn1
: