Target
Inhibitor of nuclear factor kappa-B kinase subunit beta
Ligand
BDBM25942
Substrate
I-kappa-B-alpha
Meas. Tech.
IKK Inhibition Assay
IC50
8±n/a nM
Citation
 Belema, MBunker, ANguyen, VNBeaulieu, FOuellet, CQiu, YZhang, YMartel, ABurke, JRMcIntyre, KWPattoli, MADaloisio, CGillooly, KMClarke, WJBrassil, PJZusi, FCVyas, DM Synthesis and structure-activity relationship of imidazo(1,2-a)thieno(3,2-e)pyrazines as IKK-beta inhibitors. Bioorg Med Chem Lett 17:4284-9 (2007)  
Target
Name:
Inhibitor of nuclear factor kappa-B kinase subunit beta
Synonyms:
I-kappa-B Kinase 2 (IKK-beta) I-kappa-B-kinase beta IKBKB IKK-beta IKK2/IKK1 IKKB_HUMAN Inhibitor of nuclear factor kappa B kinase beta subunit Nuclear factor NF-kappa-B inhibitor kinase beta
Type:
Serine/threonine-protein kinase
Mol. Mass.:
86554.39
Organism:
Homo sapiens (Human)
Description:
GST-tagged IKK-2 was expressed in High Five cells and purified.
Residue:
756
  
Inhibitor
Name:
BDBM25942
Synonyms:
(3-{8-[(2-aminoethyl)amino]-12-methyl-3-thia-1,7,10-triazatricyclo[7.3.0.0^{2,6}]dodeca-2(6),4,7,9,11-pentaen-4-yl}phenyl)methanol | imidazothienopyrazine, 14e
Type:
Small organic molecule
Emp. Form.:
C18H19N5OS
Mol. Mass.:
353.441
SMILES:
Cc1cnc2c(NCCN)nc3cc(sc3n12)-c1cccc(CO)c1
:
Substrate
Name:
NF-kappa-B inhibitor alpha
Synonyms:
I-kappa-B-alpha IKBA_HUMAN NF-kappa-B inhibitor alpha NFKBIA
Type:
GST fusion protein
Mol. Mass.:
35584.84
Organism:
Homo sapiens (Human)
Description:
It was produced in E. coli as GST-tagged fusion protein (Santa Cruz Biotechnology).
Residue:
317