Target
Replicase polyprotein 1ab
Ligand
BDBM50477127
Substrate
Meas. Tech.
ChEMBL_449803 (CHEMBL898907)
IC50
200000±n/a nM
Citation
 Ghosh, AKXi, KGrum-Tokars, VXu, XRatia, KFu, WHouser, KVBaker, SCJohnson, MEMesecar, AD Structure-based design, synthesis, and biological evaluation of peptidomimetic SARS-CoV 3CLpro inhibitors. Bioorg Med Chem Lett 17:5876-80 (2007)  
Target
Name:
Replicase polyprotein 1ab
Synonyms:
3C-like proteinase 3C-like proteinase (SARS-CoV 3Cpro) 3CLp GFL Guanine-N7 methyltransferase Helicase Leader protein Non-structural protein 10 Non-structural protein 3 Non-structural protein 6 Non-structural protein 8 ORF1ab polyprotein PL2-PRO Pol R1AB_SARS RdRp SARS coronavirus main proteinase nsp1 nsp12 nsp14 nsp16 nsp3 nsp5 nsp7 nsp9 pp1ab | rep
Type:
Protein
Mol. Mass.:
790250.81
Organism:
Human SARS coronavirus (SARS-CoV) (Severe acute respiratory syndrome coronavirus)
Description:
P0C6X7
Residue:
7073
  
Inhibitor
Name:
BDBM50477127
Synonyms:
CHEMBL393608
Type:
Small organic molecule
Emp. Form.:
C27H41N5O7
Mol. Mass.:
547.6437
SMILES:
[H][C@@]1(C[C@H](NC(=O)[C@H](CC(C)C)NC(=O)[C@@H](NC(=O)c2cc(C)on2)C(C)C)\C=C\C(=O)OCC)CCNC1=O
: