Target
2-Hydroxyacid oxidase 2
Ligand
BDBM50396217
Substrate
Meas. Tech.
ChEMBL_863190 (CHEMBL2175914)
IC50
300±n/a nM
Citation
 Barawkar, DABandyopadhyay, ADeshpande, AKoul, SKandalkar, SPatil, PKhose, GVyas, SMone, MBhosale, SSingh, UDe, SMeru, AGundu, JChugh, APalle, VPMookhtiar, KAVacca, JPChakravarty, PKNargund, RPWright, SDRoy, SGraziano, MPCully, DCai, TQSingh, SB Discovery of pyrazole carboxylic acids as potent inhibitors of rat long chain L-2-hydroxy acid oxidase. Bioorg Med Chem Lett 22:4341-7 (2012)  
Target
Name:
2-Hydroxyacid oxidase 2
Synonyms:
(S)-2-hydroxy-acid oxidase, peroxisomal Hao2 Haox2 Long chain alpha-hydroxy acid oxidase | Long-chain L-2-hydroxy acid oxidase
Type:
PROTEIN
Mol. Mass.:
39204.34
Organism:
Rattus norvegicus
Description:
ChEMBL_863190
Residue:
353
  
Inhibitor
Name:
BDBM50396217
Synonyms:
CHEMBL2172169
Type:
Small organic molecule
Emp. Form.:
C13H11F3N2O2
Mol. Mass.:
284.2338
SMILES:
Cc1[nH]nc(C(O)=O)c1Cc1cccc(c1)C(F)(F)F
: