Target
High affinity nerve growth factor receptor
Ligand
BDBM472731
Substrate
Meas. Tech.
Inhibitory Activity Assay
IC50
<100.0±n/a nM
Citation
 Zhu, LHu, YWu, WDai, LDuan, XYang, YSun, YHan, YPeng, YKong, FLuo, HYang, LXu, HGuo, MZhong, ZWang, S Amino pyrazolopyrimidine compound used as neurotrophic factor tyrosine kinase receptor inhibitor US Patent  US10829492 Publication Date 11/10/2020 
Target
Name:
High affinity nerve growth factor receptor
Synonyms:
2.7.10.1 NTRK1 NTRK1_HUMAN Neurotrophic tyrosine kinase receptor type 1 Synonyms=MTC TRK1-transforming tyrosine kinase protein TRKA GN Tropomyosin alpha-3 chain/High affinity nerve growth factor receptor Tropomyosin-related kinase A (TrkA) Tyrosine kinase receptor (Trk) Tyrosine kinase receptor A (Trk A) Tyrosine kinase receptor A (TrkA) p140-TrkA
Type:
Mol. Mass.:
87498.18
Organism:
Homo sapiens (Human)
Description:
P04629
Residue:
796
  
Inhibitor
Name:
BDBM472731
Synonyms:
US10829492, Example 7 | ethyl 5-(2-(2,5-difluorophenyl)pyrrolidin-1-yl)-2-(3-methylureido)pyrazolo[1,5-a]pyrimidine-3-carboxylate
Type:
Small organic molecule
Emp. Form.:
C21H22F2N6O3
Mol. Mass.:
444.4346
SMILES:
CCOC(=O)c1c(NC(=O)NC)nn2ccc(nc12)N1CCCC1c1cc(F)ccc1F
: