Target
High affinity nerve growth factor receptor
Ligand
BDBM472740
Substrate
Meas. Tech.
Inhibitory Activity Assay
IC50
<1.000±n/a nM
Citation
 Zhu, LHu, YWu, WDai, LDuan, XYang, YSun, YHan, YPeng, YKong, FLuo, HYang, LXu, HGuo, MZhong, ZWang, S Amino pyrazolopyrimidine compound used as neurotrophic factor tyrosine kinase receptor inhibitor US Patent  US10829492 Publication Date 11/10/2020 
Target
Name:
High affinity nerve growth factor receptor
Synonyms:
2.7.10.1 NTRK1 NTRK1_HUMAN Neurotrophic tyrosine kinase receptor type 1 Synonyms=MTC TRK1-transforming tyrosine kinase protein TRKA GN Tropomyosin alpha-3 chain/High affinity nerve growth factor receptor Tropomyosin-related kinase A (TrkA) Tyrosine kinase receptor (Trk) Tyrosine kinase receptor A (Trk A) Tyrosine kinase receptor A (TrkA) p140-TrkA
Type:
Mol. Mass.:
87498.18
Organism:
Homo sapiens (Human)
Description:
P04629
Residue:
796
  
Inhibitor
Name:
BDBM472740
Synonyms:
2-amino-5-((R)-2-(2,5-difluorophenyl)pyrrolidin-1-yl)-N-((2,2-dimethyl-1,3-dioxolan-4-yl)methoxy)pyrazolo[1,5-c]pyrimidine-3-carboxamide | US10829492, Example 17
Type:
Small organic molecule
Emp. Form.:
C23H26F2N6O4
Mol. Mass.:
488.4871
SMILES:
CC1(C)OCC(CONC(=O)c2c(N)nn3ccc(nc23)N2CCC[C@@H]2c2cc(F)ccc2F)O1
: