Target
High affinity nerve growth factor receptor
Ligand
BDBM472759
Substrate
Meas. Tech.
Inhibitory Activity Assay
IC50
<1.000±n/a nM
Citation
 Zhu, LHu, YWu, WDai, LDuan, XYang, YSun, YHan, YPeng, YKong, FLuo, HYang, LXu, HGuo, MZhong, ZWang, S Amino pyrazolopyrimidine compound used as neurotrophic factor tyrosine kinase receptor inhibitor US Patent  US10829492 Publication Date 11/10/2020 
Target
Name:
High affinity nerve growth factor receptor
Synonyms:
2.7.10.1 NTRK1 NTRK1_HUMAN Neurotrophic tyrosine kinase receptor type 1 Synonyms=MTC TRK1-transforming tyrosine kinase protein TRKA GN Tropomyosin alpha-3 chain/High affinity nerve growth factor receptor Tropomyosin-related kinase A (TrkA) Tyrosine kinase receptor (Trk) Tyrosine kinase receptor A (Trk A) Tyrosine kinase receptor A (TrkA) p140-TrkA
Type:
Mol. Mass.:
87498.18
Organism:
Homo sapiens (Human)
Description:
P04629
Residue:
796
  
Inhibitor
Name:
BDBM472759
Synonyms:
2-amino-5-((2R,4S)-2-(2,5-difluorophenyl)-4-fluoropyrrolidin-1-yl)pyrazolo[1,5-a]pyrimidine-3-carboxamide | US10829492, Example 36
Type:
Small organic molecule
Emp. Form.:
C17H15F3N6O
Mol. Mass.:
376.3358
SMILES:
NC(=O)c1c(N)nn2ccc(nc12)N1C[C@@H](F)C[C@@H]1c1cc(F)ccc1F
: