Target
Inhibitor of nuclear factor kappa-B kinase subunit alpha
Ligand
BDBM25957
Substrate
I-kappa-B-alpha
Meas. Tech.
IKK Inhibition Assay
IC50
220±n/a nM
Citation
 Belema, MBunker, ANguyen, VNBeaulieu, FOuellet, CQiu, YZhang, YMartel, ABurke, JRMcIntyre, KWPattoli, MADaloisio, CGillooly, KMClarke, WJBrassil, PJZusi, FCVyas, DM Synthesis and structure-activity relationship of imidazo(1,2-a)thieno(3,2-e)pyrazines as IKK-beta inhibitors. Bioorg Med Chem Lett 17:4284-9 (2007)  
Target
Name:
Inhibitor of nuclear factor kappa-B kinase subunit alpha
Synonyms:
CHUK I-kappa-B kinase 1 IKK-A IKK1 IKKA IkBKA Inhibitor of NF-kappa-B kinase alpha/beta Nuclear factor NF-kappa-B inhibitor kinase alpha TCF16 | Transcription factor 16
Type:
PROTEIN
Mol. Mass.:
84642.21
Organism:
Homo sapiens (Human)
Description:
ChEMBL_327453
Residue:
745
  
Inhibitor
Name:
BDBM25957
Synonyms:
4-[3-(aminomethyl)phenyl]-N,12-dimethyl-3-thia-1,7,10-triazatricyclo[7.3.0.0^{2,6}]dodeca-2(6),4,7,9,11-pentaen-8-amine | imidazothienopyrazine, 22a
Type:
Small organic molecule
Emp. Form.:
C17H17N5S
Mol. Mass.:
323.415
SMILES:
CNc1nc2cc(sc2n2c(C)cnc12)-c1cccc(CN)c1
:
Substrate
Name:
NF-kappa-B inhibitor alpha
Synonyms:
I-kappa-B-alpha IKBA_HUMAN NF-kappa-B inhibitor alpha NFKBIA
Type:
GST fusion protein
Mol. Mass.:
35584.84
Organism:
Homo sapiens (Human)
Description:
It was produced in E. coli as GST-tagged fusion protein (Santa Cruz Biotechnology).
Residue:
317