Target
Beta-3 adrenergic receptor
Ligand
BDBM50146156
Substrate
Meas. Tech.
ChEMBL_1554628 (CHEMBL3768724)
EC50
1064±n/a nM
Citation
 Edmondson, SDZhu, CKar, NFDi Salvo, JNagabukuro, HSacre-Salem, BDingley, KBerger, RGoble, SDMorriello, GHarper, BMoyes, CRShen, DMWang, LBall, RFitzmaurice, AFrenkl, TGichuru, LNHa, SHurley, ALJochnowitz, NLevorse, DMistry, SMiller, RROrmes, JSalituro, GMSanfiz, AStevenson, ASVilla, KZamlynny, BGreen, SStruthers, MWeber, AE Discovery of Vibegron: A Potent and Selectiveß3 Adrenergic Receptor Agonist for the Treatment of Overactive Bladder. J Med Chem 59:609-23 (2016)  
Target
Name:
Beta-3 adrenergic receptor
Synonyms:
ADRB3_RAT Adrb3r Beta-3 adrenergic receptor
Type:
PROTEIN
Mol. Mass.:
43161.83
Organism:
Rattus norvegicus
Description:
ChEMBL_1509452
Residue:
400
  
Inhibitor
Name:
BDBM50146156
Synonyms:
CHEMBL3764088
Type:
Small organic molecule
Emp. Form.:
C24H26N4O3
Mol. Mass.:
418.4882
SMILES:
[H][C@@]1(CC[C@@H](Cc2ccc(NC(=O)Cn3ncccc3=O)cc2)N1)[C@H](O)c1ccccc1
: