Target
Beta-3 adrenergic receptor
Ligand
BDBM50146154
Substrate
Meas. Tech.
ChEMBL_1554628 (CHEMBL3768724)
EC50
122±n/a nM
Citation
 Edmondson, SDZhu, CKar, NFDi Salvo, JNagabukuro, HSacre-Salem, BDingley, KBerger, RGoble, SDMorriello, GHarper, BMoyes, CRShen, DMWang, LBall, RFitzmaurice, AFrenkl, TGichuru, LNHa, SHurley, ALJochnowitz, NLevorse, DMistry, SMiller, RROrmes, JSalituro, GMSanfiz, AStevenson, ASVilla, KZamlynny, BGreen, SStruthers, MWeber, AE Discovery of Vibegron: A Potent and Selectiveß3 Adrenergic Receptor Agonist for the Treatment of Overactive Bladder. J Med Chem 59:609-23 (2016)  
Target
Name:
Beta-3 adrenergic receptor
Synonyms:
ADRB3_RAT Adrb3r Beta-3 adrenergic receptor
Type:
PROTEIN
Mol. Mass.:
43161.83
Organism:
Rattus norvegicus
Description:
ChEMBL_1509452
Residue:
400
  
Inhibitor
Name:
BDBM50146154
Synonyms:
KRP-114V Vibegron
Type:
Small organic molecule
Emp. Form.:
C26H28N4O3
Mol. Mass.:
444.5255
SMILES:
[H][C@@](O)(c1ccccc1)[C@@]1([H])CC[C@@]([H])(Cc2ccc(NC(=O)[C@]3([H])CCc4nccc(=O)n34)cc2)N1
: