Target
Peroxisome proliferator-activated receptor gamma
Ligand
BDBM28700
Substrate
Meas. Tech.
ChEMBL_305937 (CHEMBL833484)
IC50
>25000±n/a nM
Citation
 Devasthale, PVChen, SJeon, YQu, FShao, CWang, WZhang, HCap, MFarrelly, DGolla, RGrover, GHarrity, TMa, ZMoore, LRen, JSeethala, RCheng, LSleph, PSun, WTieman, AWetterau, JRDoweyko, AChandrasena, GChang, SYHumphreys, WGSasseville, VGBiller, SARyono, DESelan, FHariharan, NCheng, PT Design and synthesis of N-[(4-methoxyphenoxy)carbonyl]-N-[[4-[2-(5- methyl-2-phenyl-4-oxazolyl)ethoxy]phenyl]methyl]glycine [Muraglitazar/BMS-298585], a novel peroxisome proliferator-activated receptor alpha/gamma dual agonist with efficacious glucose and lipid-lowering activities. J Med Chem 48:2248-50 (2005)  
Target
Name:
Peroxisome proliferator-activated receptor gamma
Synonyms:
NR1C3 PPAR-gamma PPARG_HUMAN Peroxisome proliferator-activated receptor gamma (PPAR gamma) Peroxisome proliferator-activated receptor gamma (PPARĪ³) peroxisome proliferator-activated receptor gamma isoform 2
Type:
Nuclear Receptor
Mol. Mass.:
57613.46
Organism:
Homo sapiens (Human)
Description:
P37231
Residue:
505
  
Inhibitor
Name:
BDBM28700
Synonyms:
2-(4-(4-Chlorobenzoyl)phenoxy)-2-methylpropionic acid CHEMBL981 FIBRICOR LF 153 procetofenic acid
Type:
Small organic molecule
Emp. Form.:
C17H15ClO4
Mol. Mass.:
318.752
SMILES:
CC(C)(Oc1ccc(cc1)C(=O)c1ccc(Cl)cc1)C(O)=O
: